BDBM50270888 CHEMBL525201
SMILES CC(C)C[C@H](NC(=O)[C@H]1CCCN1C(=O)[C@@H](Cc1ccccc1)NC(=O)[C@H](Cc1ccccc1)NC(=O)[C@H](Cc1cnc[nH]1)NC(=O)CNC(=O)[C@@H](NC(=O)[C@@H](NC(=O)[C@H](Cc1ccccc1)NC(=O)[C@H](CCCN=C(N)N)NC(=O)[C@@H](N)CCC(N)=O)C(C)(C)S)[C@@H](C)O)C(=O)N[C@@H](Cc1ccc(O)cc1)C(=O)N1CCC[C@H]1C(=O)N[C@@H](CS)C(=O)N[C@@H](CC(N)=O)C(=O)NCC(=O)N1CCC[C@H]1C(O)=O
InChI Key InChIKey=WGJHMCNUSNAKEE-AGTNEKHFSA-N
Data  1 IC50  1 Kd
  Tab Delimited (TSV)   2D SDfile   Computed 3D by Vconf -m prep SDfile
Find this compound or compounds like it in BindingDB:
Activity Spreadsheet -- Enzyme Inhibition Constant Data from BindingDB
Found 2 hits for monomerid = 50270888
TargetIgG receptor FcRn large subunit p51(Homo sapiens (Human))
Syntonix Pharmaceuticals
Curated by ChEMBL
LigandPNGBDBM50270888(CHEMBL525201)
Affinity DataIC50:  5.90E+3nM. Assay description: Inhibition of human IgG binding to soluble human FcRn by ELISA
In DepthDetails ArticlePubMed
TargetIgG receptor FcRn large subunit p51(Homo sapiens (Human))
Syntonix Pharmaceuticals
Curated by ChEMBL
LigandPNGBDBM50270888(CHEMBL525201)
Affinity DataKd:  720nMpH: 6.0Assay Description:Binding affinity to human FcRn at pH 6 by surface plasmon resonance assay
In DepthDetails ArticlePubMed