BDBM50271202 CHEMBL4126466
SMILES CC(=O)NS(=O)(=O)c1ccc(cc1)C1=NN(C(O1)c1ccc(F)cc1F)C(C)=O
InChI Key InChIKey=CQPMXEXMKCUCPP-UHFFFAOYSA-N
Data  4 KI
  Tab Delimited (TSV)   2D SDfile   Computed 3D by Vconf -m prep SDfile
Find this compound or compounds like it in BindingDB:
Activity Spreadsheet -- Enzyme Inhibition Constant Data from BindingDB
Found 4 hits for monomerid = 50271202
TargetCarbonic anhydrase 12(Homo sapiens (Human))
University Of Cagliari
Curated by ChEMBL
LigandPNGBDBM50271202(CHEMBL4126466)
Affinity DataKi:  6.80nM. Assay description: Inhibition of recombinant human carbonic anhydrase 12 assessed as reduction in CO2 hydration pretreated for 15 mins followed by CO2 addition measured...
In DepthDetails ArticlePubMed
TargetCarbonic anhydrase 2(Homo sapiens (Human))
University Of Cagliari
Curated by ChEMBL
LigandPNGBDBM50271202(CHEMBL4126466)
Affinity DataKi:  327nM. Assay description: Inhibition of recombinant human carbonic anhydrase 2 assessed as reduction in CO2 hydration pretreated for 15 mins followed by CO2 addition measured ...
In DepthDetails ArticlePubMed
TargetCarbonic anhydrase 9(Homo sapiens (Human))
University Of Cagliari
Curated by ChEMBL
LigandPNGBDBM50271202(CHEMBL4126466)
Affinity DataKi:  373nM. Assay description: Inhibition of recombinant human carbonic anhydrase 9 assessed as reduction in CO2 hydration pretreated for 15 mins followed by CO2 addition measured ...
In DepthDetails ArticlePubMed
TargetCarbonic anhydrase 1(Homo sapiens (Human))
University Of Cagliari
Curated by ChEMBL
LigandPNGBDBM50271202(CHEMBL4126466)
Affinity DataKi:  8.93E+3nM. Assay description: Inhibition of recombinant human carbonic anhydrase 1 assessed as reduction in CO2 hydration pretreated for 15 mins followed by CO2 addition measured ...
In DepthDetails ArticlePubMed