BDBM50272180 CHEMBL4128355
SMILES Cc1ccc(cc1)S(=O)(=O)NC(C(=O)Nc1ccc(cc1)C(N)=N)c1ccccc1
InChI Key InChIKey=YDYVYWWEAYYRHA-UHFFFAOYSA-N
Data  2 IC50
  Tab Delimited (TSV)   2D SDfile   Computed 3D by Vconf -m prep SDfile
Find this compound or compounds like it in BindingDB:
Activity Spreadsheet -- Enzyme Inhibition Constant Data from BindingDB
Found 2 hits for monomerid = 50272180
TargetUrokinase-type plasminogen activator(Homo sapiens (Human))
University Of Helsinki
Curated by ChEMBL
LigandPNGBDBM50272180(CHEMBL4128355)
Affinity DataIC50:  6.00E+4nM. Assay description: Inhibition of recombinant C-terminal His10-tagged human uPA (M1 to L431 residues) expressed in mouse NS0 cells using Z-GGR-AMC as substrate after 15 ...
Ligand InfoPC cidPC sid
In DepthDetails ArticlePubMed
TargetSerine protease hepsin(Homo sapiens (Human))
University Of Helsinki
Curated by ChEMBL
LigandPNGBDBM50272180(CHEMBL4128355)
Affinity DataIC50:  250nM. Assay description: Inhibition of recombinant C-terminal His10-tagged human Hepsin (R45 to L17 residues) D161E/ R162K double mutant expressed in mouse NS0 cells using Bo...
Ligand InfoPC cidPC sid
In DepthDetails ArticlePubMed