BDBM50272283 6-(4-ethylphenyl)-4-(1H-indazol-5-yl)pyrimidin-2(1H)-one::CHEMBL501731
SMILES CCc1ccc(cc1)-c1cc(nc(=O)[nH]1)-c1ccc2n[nH]cc2c1
InChI Key InChIKey=CKDGWVVOAMTOQJ-UHFFFAOYSA-N
Data  1 IC50
  Tab Delimited (TSV)   2D SDfile   Computed 3D by Vconf -m prep SDfile
Find this compound or compounds like it in BindingDB:
Activity Spreadsheet -- Enzyme Inhibition Constant Data from BindingDB
Found 1 hit for monomerid = 50272283
TargetCell division cycle 7-related protein kinase(Homo sapiens (Human))
Novartis Institutes Of Biomedical Research
Curated by ChEMBL
LigandPNGBDBM50272283(6-(4-ethylphenyl)-4-(1H-indazol-5-yl)pyrimidin-2(1...)
Affinity DataIC50:  100nM. Assay description: Inhibition of CDC7-DBF4 (unknown origin)
In DepthDetails ArticlePubMed