BDBM50272350 CHEMBL4127961
SMILES Cc1ccc(cc1)S(=O)(=O)NC(CC1CCCC1)C(=O)Nc1ccc(cc1)C(N)=N
InChI Key InChIKey=LBHFJYVXQATNJS-UHFFFAOYSA-N
Data  2 IC50
  Tab Delimited (TSV)   2D SDfile   Computed 3D by Vconf -m prep SDfile
Find this compound or compounds like it in BindingDB:
Activity Spreadsheet -- Enzyme Inhibition Constant Data from BindingDB
Found 2 hits for monomerid = 50272350
TargetUrokinase-type plasminogen activator(Homo sapiens (Human))
University Of Helsinki
Curated by ChEMBL
LigandPNGBDBM50272350(CHEMBL4127961)
Affinity DataIC50:  1.60E+4nM. Assay description: Inhibition of recombinant C-terminal His10-tagged human uPA (M1 to L431 residues) expressed in mouse NS0 cells using Z-GGR-AMC as substrate after 15 ...
In DepthDetails ArticlePubMed
TargetSerine protease hepsin(Homo sapiens (Human))
University Of Helsinki
Curated by ChEMBL
LigandPNGBDBM50272350(CHEMBL4127961)
Affinity DataIC50:  700nM. Assay description: Inhibition of recombinant C-terminal His10-tagged human Hepsin (R45 to L17 residues) D161E/ R162K double mutant expressed in mouse NS0 cells using Bo...
In DepthDetails ArticlePubMed