BDBM50272591 CHEMBL4128835
SMILES Cl.Cl.C[C@@H](N[C@H]1CCN(C1)c1ccc(CC(O)=O)cc1)c1cccc2ccccc12
InChI Key InChIKey=GGCDGPMTTKKELW-KJHBKDRRSA-N
Data  10 IC50  1 EC50
  Tab Delimited (TSV)   2D SDfile   Computed 3D by Vconf -m prep SDfile
Find this compound or compounds like it in BindingDB:
Activity Spreadsheet -- Enzyme Inhibition Constant Data from BindingDB
Found 11 hits for monomerid = 50272591
TargetCytochrome P450 2C8(Homo sapiens (Human))
Mitsubishi Tanabe Pharma
Curated by ChEMBL
LigandPNGBDBM50272591(CHEMBL4128835)
Affinity DataIC50: >5.00E+4nM. Assay description: Inhibition of CYP2C8 (unknown origin)
In DepthDetails ArticlePubMed
TargetCytochrome P450 2D6(Homo sapiens (Human))
Mitsubishi Tanabe Pharma
Curated by ChEMBL
LigandPNGBDBM50272591(CHEMBL4128835)
Affinity DataIC50: >5.00E+4nM. Assay description: Inhibition of CYP2D6 (unknown origin)
In DepthDetails ArticlePubMed
TargetExtracellular calcium-sensing receptor(Homo sapiens (Human))
Mitsubishi Tanabe Pharma
Curated by ChEMBL
LigandPNGBDBM50272591(CHEMBL4128835)
Affinity DataEC50:  93nM. Assay description: Agonist activity at human CaSR expressed in CHO cells assessed as increase in intracellular calcium mobilization after 1 hr by Fura-2 dye-based fluor...
In DepthDetails ArticlePubMed
TargetCytochrome P450 1A2(Homo sapiens (Human))
Mitsubishi Tanabe Pharma
Curated by ChEMBL
LigandPNGBDBM50272591(CHEMBL4128835)
Affinity DataIC50: >5.00E+4nM. Assay description: Inhibition of CYP1A2 (unknown origin)
In DepthDetails ArticlePubMed
TargetCytochrome P450 2A6(Homo sapiens (Human))
Mitsubishi Tanabe Pharma
Curated by ChEMBL
LigandPNGBDBM50272591(CHEMBL4128835)
Affinity DataIC50: >5.00E+4nM. Assay description: Inhibition of CYP2A6 (unknown origin)
In DepthDetails ArticlePubMed
TargetCytochrome P450 3A4/3A5(Homo sapiens (Human))
Mitsubishi Tanabe Pharma
Curated by ChEMBL
LigandPNGBDBM50272591(CHEMBL4128835)
Affinity DataIC50: >5.00E+4nM. Assay description: Inhibition of CYP3A4/5 (unknown origin)
In DepthDetails ArticlePubMed
TargetCytochrome P450 2C9(Homo sapiens (Human))
Mitsubishi Tanabe Pharma
Curated by ChEMBL
LigandPNGBDBM50272591(CHEMBL4128835)
Affinity DataIC50: >5.00E+4nM. Assay description: Inhibition of CYP2C9 (unknown origin)
In DepthDetails ArticlePubMed
TargetExtracellular calcium-sensing receptor(Rattus norvegicus)
Mitsubishi Tanabe Pharma
Curated by ChEMBL
LigandPNGBDBM50272591(CHEMBL4128835)
Affinity DataIC50:  31nM. Assay description: Agonist activity at CaSR in rat parathyroid cells assessed as inhibition of PTH (1 to 84 residues) production in presence of Cacl2 by ELISA
In DepthDetails ArticlePubMed
TargetCytochrome P450 2C19(Homo sapiens (Human))
Mitsubishi Tanabe Pharma
Curated by ChEMBL
LigandPNGBDBM50272591(CHEMBL4128835)
Affinity DataIC50: >5.00E+4nM. Assay description: Inhibition of CYP2C19 (unknown origin)
In DepthDetails ArticlePubMed
TargetCytochrome P450 2E1(Homo sapiens (Human))
Mitsubishi Tanabe Pharma
Curated by ChEMBL
LigandPNGBDBM50272591(CHEMBL4128835)
Affinity DataIC50: >5.00E+4nM. Assay description: Inhibition of CYP2E1 (unknown origin)
In DepthDetails ArticlePubMed
TargetCytochrome P450 2B6(Homo sapiens (Human))
Mitsubishi Tanabe Pharma
Curated by ChEMBL
LigandPNGBDBM50272591(CHEMBL4128835)
Affinity DataIC50: >5.00E+4nM. Assay description: Inhibition of CYP2B6 (unknown origin)
In DepthDetails ArticlePubMed