BDBM50273128 CHEMBL4127856
SMILES Cl.COc1ccc(cc1OC)-c1cn2cc(cc(N)c2n1)C(=O)NCCc1ccc(O)cc1
InChI Key InChIKey=HJFQJEXYEBVBHS-UHFFFAOYSA-N
Data  1 KI
  Tab Delimited (TSV)   2D SDfile   Computed 3D by Vconf -m prep SDfile
Find this compound or compounds like it in BindingDB:
Activity Spreadsheet -- Enzyme Inhibition Constant Data from BindingDB
Found 1 hit for monomerid = 50273128
TargetAdenosine receptor A2a(Homo sapiens (Human))
Universities Of Lille
Curated by ChEMBL
LigandPNGBDBM50273128(CHEMBL4127856)
Affinity DataKi: >1.00E+4nM. Assay description: Displacement of [3H]-ZM-241385 from human adenosine A2A receptor expressed in HEK293 cell membranes after 1 hr by scintillation counting analysis
Ligand InfoPC cidPC sid
In DepthDetails ArticlePubMed