BDBM50273138 4-Hydroxy-3-[2-(4-isopropyl-phenyl)-ethylsulfamoyl]-benzamidine::CHEMBL463581
SMILES CC(C)c1ccc(CCNS(=O)(=O)c2cc(ccc2O)C(N)=N)cc1
InChI Key InChIKey=NRKZYPGMNRQDCC-UHFFFAOYSA-N
Data  2 KI
  Tab Delimited (TSV)   2D SDfile   Computed 3D by Vconf -m prep SDfile
Find this compound or compounds like it in BindingDB:
Activity Spreadsheet -- Enzyme Inhibition Constant Data from BindingDB
Found 2 hits for monomerid = 50273138
TargetCoagulation factor X(Homo sapiens (Human))
Kissei Pharmaceutical
Curated by ChEMBL
LigandPNGBDBM50273138(4-Hydroxy-3-[2-(4-isopropyl-phenyl)-ethylsulfamoyl...)
Affinity DataKi:  29nM. Assay description: Inhibition of human factor 10a by Dixon-plot method
In DepthDetails ArticlePubMed
TargetProthrombin(Homo sapiens (Human))
Kissei Pharmaceutical
Curated by ChEMBL
LigandPNGBDBM50273138(4-Hydroxy-3-[2-(4-isopropyl-phenyl)-ethylsulfamoyl...)
Affinity DataKi: >1.00E+4nM. Assay description: Inhibition of human thrombin by Dixon-plot method
In DepthDetails ArticlePubMed