BDBM50273353 (S)-1-(2-((S)-2-((S)-2-((S)-2-(2-((S)-2-((S)-2-((S)-2-((S)-2-((2S,3R)-2-((S)-3-(1H-indol-3-yl)-2-(2-(methylamino)acetamido)propanamido)-3-hydroxybutanamido)-4-methylpentanamido)-4-amino-4-oxobutanamido)-3-hydroxypropanamido)propanamido)acetamido)-3-(4-hydroxyphenyl)propanamido)-4-methylpentanamido)-4-methylpentanamido)acetyl)-N-((S)-6-amino-1-((S)-6-amino-1-((S)-6-amino-1-((S)-1,6-diamino-1-oxohexan-2-ylamino)-1-oxohexan-2-ylamino)-1-oxohexan-2-ylamino)-1-oxohexan-2-yl)pyrrolidine-2-carboxamide::CHEMBL525055
SMILES CNCC(=O)N[C@@H](Cc1c[nH]c2ccccc12)C(=O)N[C@@H]([C@@H](C)O)C(=O)N[C@@H](CC(C)C)C(=O)N[C@@H](CC(N)=O)C(=O)N[C@@H](CO)C(=O)N[C@@H](C)C(=O)NCC(=O)N[C@@H](Cc1ccc(O)cc1)C(=O)N[C@@H](CC(C)C)C(=O)N[C@@H](CC(C)C)C(=O)NCC(=O)N1CCC[C@H]1C(=O)N[C@@H](CCCCN)C(=O)N[C@@H](CCCCN)C(=O)N[C@@H](CCCCN)C(=O)N[C@@H](CCCCN)C(N)=O
InChI Key InChIKey=NJTGSJIMKWTQSD-GFUYWXIVSA-N
Data  2 KI
  Tab Delimited (TSV)   2D SDfile   Computed 3D by Vconf -m prep SDfile
Find this compound or compounds like it in BindingDB:
Activity Spreadsheet -- Enzyme Inhibition Constant Data from BindingDB
Found 2 hits for monomerid = 50273353
TargetGalanin receptor type 1(Homo sapiens (Human))
University Of Utah
Curated by ChEMBL
LigandPNGBDBM50273353((S)-1-(2-((S)-2-((S)-2-((S)-2-(2-((S)-2-((S)-2-((S...)
Affinity DataKi:  0.400nM. Assay description: Displacement of europium-labeled galanin from human GalR1 expressed in HEK293 EBNA cells
In DepthDetails ArticlePubMed
TargetGalanin receptor type 2(Homo sapiens (Human))
University Of Utah
Curated by ChEMBL
LigandPNGBDBM50273353((S)-1-(2-((S)-2-((S)-2-((S)-2-(2-((S)-2-((S)-2-((S...)
Affinity DataKi:  24nM. Assay description: Displacement of europium-labeled galanin from human GalR2 expressed in CHO-K1 cells
In DepthDetails ArticlePubMed