BDBM50273626 CHEMBL4126542
SMILES Cc1noc(C)c1-c1cc(O)cc(c1)C(O)C1CC1
InChI Key InChIKey=USPBPHTUVMOACY-UHFFFAOYSA-N
Data  2 IC50
PDB links: 1 PDB ID matches this monomer.
  Tab Delimited (TSV)   2D SDfile   Computed 3D by Vconf -m prep SDfile
Find this compound or compounds like it in BindingDB:
Activity Spreadsheet -- Enzyme Inhibition Constant Data from BindingDB
Found 2 hits for monomerid = 50273626
TargetBromodomain-containing protein 4(Homo sapiens (Human))
University Of Oxford
Curated by ChEMBL
LigandPNGBDBM50273626(CHEMBL4126542)
Affinity DataIC50:  380nM. Assay description: Inhibition of recombinant His6-tagged human BRD4 bromodomain 1 expressed in Escherichia coli BL21(DE3)-R3-pRARE2 cells preincubated for 30 mins follo...
TargetBromodomain-containing protein 4(Homo sapiens (Human))
University Of Oxford
Curated by ChEMBL
LigandPNGBDBM50273626(CHEMBL4126542)
Affinity DataIC50:  377nM. Assay description: Inhibition of recombinant His6-tagged human BRD4 bromodomain 1 expressed in Escherichia coli BL21(DE3)-R3-pRARE2 cells preincubated for 30 mins follo...