BDBM50275224 1-(1-Benzyl-1,2,3,4-tetrahydroquinolin-6-yloxy)-3-[4-(4-fluorophenyl)pipera-zin-1-yl] propan-2-ol::CHEMBL488793
SMILES OC(COc1ccc2N(Cc3ccccc3)CCCc2c1)CN1CCN(CC1)c1ccc(F)cc1
InChI Key InChIKey=FWDSENPOIMMHCW-UHFFFAOYSA-N
Data  1 IC50
  Tab Delimited (TSV)   2D SDfile   Computed 3D by Vconf -m prep SDfile
Find this compound or compounds like it in BindingDB:
Activity Spreadsheet -- Enzyme Inhibition Constant Data from BindingDB
Found 1 hit for monomerid = 50275224
TargetBeta-3 adrenergic receptor(Homo sapiens (Human))
Central Drug Research Institute
Curated by ChEMBL
LigandPNGBDBM50275224(1-(1-Benzyl-1,2,3,4-tetrahydroquinolin-6-yloxy)-3-...)
Affinity DataIC50:  1.76E+3nM. Assay description: Displacement of [125I]iodocynopindolol from human adrenergic beta3 receptor
In DepthDetails ArticlePubMed