BDBM50276099 CHEMBL4130016
SMILES COc1cc(ccc1Nc1ncc2c(n1)n(-c1cccc(NC(=O)C=C)c1)c(=O)n(CCCc1ccccc1)c2=O)N1CCC(CC1)N(C)C
InChI Key InChIKey=ZGLKRNQYRQCDLQ-UHFFFAOYSA-N
Data  3 IC50
  Tab Delimited (TSV)   2D SDfile   Computed 3D by Vconf -m prep SDfile
Find this compound or compounds like it in BindingDB:
Activity Spreadsheet -- Enzyme Inhibition Constant Data from BindingDB
Found 3 hits for monomerid = 50276099
TargetEpidermal growth factor receptor(Homo sapiens (Human))
East China University Of Science And Technology
Curated by ChEMBL
LigandPNGBDBM50276099(CHEMBL4130016)
Affinity DataIC50:  1.40nM. Assay description: Inhibition of recombinant human GST-tagged EGFR L858R/T790M double mutant expressed in baculovirus expression system using Poly(Glu,Tyr)4:1 as substr...
In DepthDetails ArticlePubMed
TargetTyrosine-protein kinase BTK(Homo sapiens (Human))
East China University Of Science & Technology
Curated by ChEMBL
LigandPNGBDBM50276099(CHEMBL4130016)
Affinity DataIC50:  76nM. Assay description: Inhibition of BTK (unknown origin) by ELISA
In DepthDetails ArticlePubMed
TargetEpidermal growth factor receptor(Homo sapiens (Human))
East China University Of Science And Technology
Curated by ChEMBL
LigandPNGBDBM50276099(CHEMBL4130016)
Affinity DataIC50:  3.80nM. Assay description: Inhibition of recombinant human GST-tagged EGFR (668 to 1210 residues) expressed in baculovirus expression system using Poly(Glu,Tyr)4:1 as substrate...
In DepthDetails ArticlePubMed