BDBM50276133 CHEMBL4126630
SMILES CC(C)n1c(=O)n(-c2cccc(NC(=O)C=C)c2)c2nc(Nc3ccc(N4CCN(C)CC4)c(C)c3)ncc2c1=O
InChI Key InChIKey=HPMZWNAUYGUQTC-UHFFFAOYSA-N
Data  3 IC50
  Tab Delimited (TSV)   2D SDfile   Computed 3D by Vconf -m prep SDfile
Find this compound or compounds like it in BindingDB:
Activity Spreadsheet -- Enzyme Inhibition Constant Data from BindingDB
Found 3 hits for monomerid = 50276133
TargetEpidermal growth factor receptor(Homo sapiens (Human))
East China University Of Science And Technology
Curated by ChEMBL
LigandPNGBDBM50276133(CHEMBL4126630)
Affinity DataIC50:  34nM. Assay description: Inhibition of recombinant human GST-tagged EGFR (668 to 1210 residues) expressed in baculovirus expression system using Poly(Glu,Tyr)4:1 as substrate...
In DepthDetails ArticlePubMed
TargetTyrosine-protein kinase BTK(Homo sapiens (Human))
East China University Of Science & Technology
Curated by ChEMBL
LigandPNGBDBM50276133(CHEMBL4126630)
Affinity DataIC50:  0.800nM. Assay description: Inhibition of BTK (unknown origin) by ELISA
In DepthDetails ArticlePubMed
TargetEpidermal growth factor receptor(Homo sapiens (Human))
East China University Of Science And Technology
Curated by ChEMBL
LigandPNGBDBM50276133(CHEMBL4126630)
Affinity DataIC50:  1nM. Assay description: Inhibition of recombinant human GST-tagged EGFR L858R/T790M double mutant expressed in baculovirus expression system using Poly(Glu,Tyr)4:1 as substr...
In DepthDetails ArticlePubMed