BDBM50276376 CHEMBL4126909
SMILES CC(=O)OC[C@H]1OCC(=O)C(F)=C1
InChI Key InChIKey=KTNQCVXPVIYIHU-LURJTMIESA-N
Data  2 IC50
  Tab Delimited (TSV)   2D SDfile   Computed 3D by Vconf -m prep SDfile
Find this compound or compounds like it in BindingDB:
Activity Spreadsheet -- Enzyme Inhibition Constant Data from BindingDB
Found 2 hits for monomerid = 50276376
TargetNACHT, LRR and PYD domains-containing protein 3(Mus musculus)
The Noguchi Institute
Curated by ChEMBL
LigandPNGBDBM50276376(CHEMBL4126909)
Affinity DataIC50:  3.20E+3nM. Assay description: Inhibition of nigericin-induced NLRP3 inflammasome activation in C57BL/6 mouse bone marrow derived macrophages assessed as reduction in LPS-stimulate...
In DepthDetails ArticlePubMed
TargetNACHT, LRR and PYD domains-containing protein 3(Homo sapiens (Human))
The Noguchi Institute
Curated by ChEMBL
LigandPNGBDBM50276376(CHEMBL4126909)
Affinity DataIC50:  3.70E+3nM. Assay description: Inhibition of nigericin-induced NLRP3 inflammasome activation in PMA-differentiated human THP1 cells assessed as reduction in LPS-stimulated IL-1beta...
In DepthDetails ArticlePubMed