BDBM50277156 CHEMBL4165328
SMILES CN(C)c1ncnc2n(cnc12)[C@@H]1O[C@H](CO)[C@@H](NC(=O)[C@@H](N)CSC(c2ccccc2)(c2ccccc2)c2ccccc2)[C@H]1O
InChI Key InChIKey=FRQVIWIHNUYHNT-ZBZVAINTSA-N
Data  2 IC50
  Tab Delimited (TSV)   2D SDfile   Computed 3D by Vconf -m prep SDfile
Find this compound or compounds like it in BindingDB:
Activity Spreadsheet -- Enzyme Inhibition Constant Data from BindingDB
Found 2 hits for monomerid = 50277156
TargetPuromycin-sensitive aminopeptidase(Homo sapiens (Human))
University Of Minnesota
Curated by ChEMBL
LigandPNGBDBM50277156(CHEMBL4165328)
Affinity DataIC50:  1.40E+3nM. Assay description: Inhibition of recombinant human N-terminal His6-MBP-tagged PSA expressed in Escherichia coli BL21 STAR (DE3) using 4-Ala-MNA as substrate measured fo...
In DepthDetails ArticlePubMed
TargetAminopeptidase N(Homo sapiens (Human))
University Of Minnesota
Curated by ChEMBL
LigandPNGBDBM50277156(CHEMBL4165328)
Affinity DataIC50:  280nM. Assay description: Inhibition of recombinant human C-terminal His10-tagged APN (Lys69 to Lys967 residues) using Ala-AMC as substrate measured for 30 mins by fluorescenc...
In DepthDetails ArticlePubMed