BDBM50277158 3123L::CHEBI:17939::CL-13900::GNF-Pf-2016::P-638::Puromycin::TCMDC-123493
SMILES COc1ccc(C[C@H](N)C(=O)N[C@@H]2[C@@H](CO)O[C@H]([C@@H]2O)n2cnc3c(ncnc23)N(C)C)cc1
InChI Key InChIKey=RXWNCPJZOCPEPQ-NVWDDTSBSA-N
Data  5 IC50
PDB links: 6 PDB IDs match this monomer.
  Tab Delimited (TSV)   2D SDfile   Computed 3D by Vconf -m prep SDfile
Find this compound or compounds like it in BindingDB:
Activity Spreadsheet -- Enzyme Inhibition Constant Data from BindingDB
Found 5 hits for monomerid = 50277158
TargetPuromycin-sensitive aminopeptidase(Homo sapiens (Human))
University Of Minnesota
Curated by ChEMBL
LigandPNGBDBM50277158(3123L | CHEBI:17939 | CL-13900 | GNF-Pf-2016 | P-6...)
Affinity DataIC50:  9.70E+3nM. Assay description: Inhibition of recombinant human N-terminal His6-MBP-tagged PSA expressed in Escherichia coli BL21 STAR (DE3) using 4-Ala-MNA as substrate measured fo...
In DepthDetails ArticlePubMed
TargetAminopeptidase N(Homo sapiens (Human))
University Of Minnesota
Curated by ChEMBL
LigandPNGBDBM50277158(3123L | CHEBI:17939 | CL-13900 | GNF-Pf-2016 | P-6...)
Affinity DataIC50:  4.10E+4nM. Assay description: Inhibition of recombinant human C-terminal His10-tagged APN (Lys69 to Lys967 residues) using Ala-AMC as substrate measured for 30 mins by fluorescenc...
In DepthDetails ArticlePubMed
TargetTyrosyl-DNA phosphodiesterase 1(Homo sapiens (Human))
Russian Academy Of Sciences
Curated by ChEMBL
LigandPNGBDBM50277158(3123L | CHEBI:17939 | CL-13900 | GNF-Pf-2016 | P-6...)
Affinity DataIC50:  1.80E+7nM. Assay description: Inhibition of human N-terminal His-tagged TDP1 expressed in Escherichia coli BL21 using [32P]-D14Y duplex DNA as substrate incubated for 20 mins by P...
In DepthDetails ArticlePubMed
TargetPuromycin-sensitive aminopeptidase(Homo sapiens (Human))
University Of Minnesota
Curated by ChEMBL
LigandPNGBDBM50277158(3123L | CHEBI:17939 | CL-13900 | GNF-Pf-2016 | P-6...)
Affinity DataIC50:  2.45E+3nM. Assay description: Inhibition of recombinant human puromycin sensitive aminopeptidase using Leu-pNA as substrate after 30 mins
In DepthDetails ArticlePubMed
TargetAminopeptidase N(Sus scrofa (Pig))
Csir-Indian Institute Of Chemical Technology
Curated by ChEMBL
LigandPNGBDBM50277158(3123L | CHEBI:17939 | CL-13900 | GNF-Pf-2016 | P-6...)
Affinity DataIC50: >1.00E+5nM. Assay description: Inhibition of porcine aminopeptidase-N using Leu-pNA as substrate after 30 mins
In DepthDetails ArticlePubMed