BDBM50277616 CHEMBL4167344
SMILES COc1ccc(Nc2nccc(n2)-c2cn(CCN3CCOCC3)c3ccccc23)c(OC)c1
InChI Key InChIKey=RLAGHISFSWKXEN-UHFFFAOYSA-N
Data  1 KI
  Tab Delimited (TSV)   2D SDfile   Computed 3D by Vconf -m prep SDfile
Find this compound or compounds like it in BindingDB:
Activity Spreadsheet -- Enzyme Inhibition Constant Data from BindingDB
Found 1 hit for monomerid = 50277616
TargetMAP kinase-interacting serine/threonine-protein kinase 2(Homo sapiens (Human))
University Of South Australia
Curated by ChEMBL
LigandPNGBDBM50277616(CHEMBL4167344)
Affinity DataKi:  300nM. Assay description: Inhibition of recombinant full length human N-terminal GST-tagged MNK2 expressed in baculovirus expression system using N-terminal TAMRA-labeled eIF4...
In DepthDetails ArticlePubMed