BDBM50278083 4-(3,5-dimethoxybenzylidene)-1-(4-methoxyphenyl)pyrazolidine-3,5-dione::CHEMBL484166
SMILES COc1ccc(cc1)N1NC(=O)C(=Cc2cc(OC)cc(OC)c2)C1=O
InChI Key InChIKey=CZYYFGZIVHIVRS-UHFFFAOYSA-N
Data  1 IC50
  Tab Delimited (TSV)   2D SDfile   Computed 3D by Vconf -m prep SDfile
Find this compound or compounds like it in BindingDB:
Activity Spreadsheet -- Enzyme Inhibition Constant Data from BindingDB
Found 1 hit for monomerid = 50278083
TargetDual specificity tyrosine-phosphorylation-regulated kinase 1A(Homo sapiens (Human))
Inje University
Curated by ChEMBL
LigandPNGBDBM50278083(4-(3,5-dimethoxybenzylidene)-1-(4-methoxyphenyl)py...)
Affinity DataIC50: >5.00E+4nM. Assay description: Inhibition of Dyrk1 (unknown origin) autophosphorylation
In DepthDetails ArticlePubMed