BDBM50278826 4-(4-(4-hydroxy-3-methoxybenzylidene)-3,5-dioxopyrazolidin-1-yl)benzonitrile::CHEMBL498718
SMILES COc1cc(C=C2C(=O)NN(C2=O)c2ccc(cc2)C#N)ccc1O
InChI Key InChIKey=RNIKCEGIODQELD-UHFFFAOYSA-N
Data  1 IC50
  Tab Delimited (TSV)   2D SDfile   Computed 3D by Vconf -m prep SDfile
Find this compound or compounds like it in BindingDB:
Activity Spreadsheet -- Enzyme Inhibition Constant Data from BindingDB
Found 1 hit for monomerid = 50278826
TargetDual specificity tyrosine-phosphorylation-regulated kinase 1A(Homo sapiens (Human))
Inje University
Curated by ChEMBL
LigandPNGBDBM50278826(4-(4-(4-hydroxy-3-methoxybenzylidene)-3,5-dioxopyr...)
Affinity DataIC50:  600nM. Assay description: Inhibition of Dyrk1 (unknown origin) autophosphorylation
In DepthDetails ArticlePubMed