BDBM50279834 (2R,3S,4R,5S)-2-(hydroxymethyl)oxane-3,4,5-triol::1,5-anhydro-D-glucitol::CHEMBL344637
SMILES OC[C@H]1OC[C@H](O)[C@@H](O)[C@@H]1O
InChI Key InChIKey=MPCAJMNYNOGXPB-SLPGGIOYSA-N
Data  2 KI
PDB links: 11 PDB IDs match this monomer.
  Tab Delimited (TSV)   2D SDfile   Computed 3D by Vconf -m prep SDfile
Find this compound or compounds like it in BindingDB:
Activity Spreadsheet -- Enzyme Inhibition Constant Data from BindingDB
Found 1 hit for monomerid = 50279834
TargetBeta-glucosidase(Prunus avium)
TBA
Curated by ChEMBL
LigandPNGBDBM50279834((2R,3S,4R,5S)-2-(hydroxymethyl)oxane-3,4,5-triol |...)
Affinity DataKi:  6.00E+7nM. Assay description: Binding affinity towards sweet almond Beta-glucosidase
In DepthDetails Article