BDBM50281140 (2R,3R,4S,5R)-2-[2-Bromo-6-(piperidin-1-ylamino)-purin-9-yl]-5-hydroxymethyl-tetrahydro-furan-3,4-diol::CHEMBL88841
SMILES OC[C@H]1O[C@H]([C@H](O)[C@@H]1O)n1cnc2c(NN3CCCCC3)nc(Br)nc12
InChI Key InChIKey=WXOHKINLTMKOIK-IDTAVKCVSA-N
Data  2 KI
  Tab Delimited (TSV)   2D SDfile   Computed 3D by Vconf -m prep SDfile
Find this compound or compounds like it in BindingDB:
Activity Spreadsheet -- Enzyme Inhibition Constant Data from BindingDB
Found 2 hits for monomerid = 50281140
TargetAdenosine receptor A1(Rattus norvegicus (rat))
TBA
Curated by ChEMBL
LigandPNGBDBM50281140((2R,3R,4S,5R)-2-[2-Bromo-6-(piperidin-1-ylamino)-p...)
Affinity DataKi:  9.30nM. Assay description: Tested for inhibition of adenosine A1 receptor binding to rat brain
In DepthDetails Article
TargetAdenosine receptor A2a/A2b(Rattus norvegicus)
TBA
Curated by ChEMBL
LigandPNGBDBM50281140((2R,3R,4S,5R)-2-[2-Bromo-6-(piperidin-1-ylamino)-p...)
Affinity DataKi:  1.52E+3nM. Assay description: Tested for inhibition of adenosine A2 receptor binding to rat brain
In DepthDetails Article