BDBM50282022 (trans)-3-{3-[5-(4-Methoxy-phenyl)-tetrahydro-furan-2-yloxy]-propyl}-pyridine::CHEMBL286677
SMILES COc1ccc(cc1)[C@@H]1CC[C@@H](OCCCc2cccnc2)O1
InChI Key InChIKey=VBPOKQWXZVFOPS-OALUTQOASA-N
Data  1 IC50
  Tab Delimited (TSV)   2D SDfile   Computed 3D by Vconf -m prep SDfile
Find this compound or compounds like it in BindingDB:
Activity Spreadsheet -- Enzyme Inhibition Constant Data from BindingDB
Found 1 hit for monomerid = 50282022
TargetPlatelet-activating factor receptor(Homo sapiens (Human))
TBA
Curated by ChEMBL
LigandPNGBDBM50282022((trans)-3-{3-[5-(4-Methoxy-phenyl)-tetrahydro-fura...)
Affinity DataIC50:  4.00E+3nM. Assay description: In vitro inhibition of [3H]PAF receptor binding to washed human platelet membranes
In DepthDetails Article