BDBM50282029 (cis)-3-{3-[5-(3,4,5-Trimethoxy-phenyl)-tetrahydro-furan-2-yloxy]-propyl}-pyridine::CHEMBL37809
SMILES COc1cc(cc(OC)c1OC)[C@H]1CC[C@@H](OCCCc2cccnc2)O1
InChI Key InChIKey=YHPMSNPULLVNAA-XLIONFOSSA-N
Data  1 IC50
  Tab Delimited (TSV)   2D SDfile   Computed 3D by Vconf -m prep SDfile
Find this compound or compounds like it in BindingDB:
Activity Spreadsheet -- Enzyme Inhibition Constant Data from BindingDB
Found 1 hit for monomerid = 50282029
TargetPlatelet-activating factor receptor(Homo sapiens (Human))
TBA
Curated by ChEMBL
LigandPNGBDBM50282029((cis)-3-{3-[5-(3,4,5-Trimethoxy-phenyl)-tetrahydro...)
Affinity DataIC50:  100nM. Assay description: In vitro inhibition of [3H]PAF receptor binding to washed human platelet membranes
In DepthDetails Article