BDBM50283481 CHEMBL4160675
SMILES CCc1nn2c(cc(C)nc2c1-c1cc(F)c(OC(F)F)cc1F)C(F)(F)F
InChI Key InChIKey=SDDZGCNKTOUMEI-UHFFFAOYSA-N
Data  6 EC50
  Tab Delimited (TSV)   2D SDfile   Computed 3D by Vconf -m prep SDfile
Find this compound or compounds like it in BindingDB:
Activity Spreadsheet -- Enzyme Inhibition Constant Data from BindingDB
Found 6 hits for monomerid = 50283481
TargetMetabotropic glutamate receptor 7(Rattus norvegicus (Rat))
Vanderbilt University
Curated by ChEMBL
LigandPNGBDBM50283481(CHEMBL4160675)
Affinity DataEC50:  740nM. Assay description: Positive allosteric modulation of rat mGlu7 receptor expressed in HEK cells co-expressing Galphai5 assessed as increase in glutamate-induced calcium ...
In DepthDetails ArticlePubMed
TargetMetabotropic glutamate receptor 8(Rattus norvegicus (Rat))
Vanderbilt University
Curated by ChEMBL
LigandPNGBDBM50283481(CHEMBL4160675)
Affinity DataEC50:  891nM. Assay description: Positive allosteric modulation of rat mGlu8 receptor expressed in HEK cells co-expressing Galphai5 assessed as increase in glutamate-induced calcium ...
In DepthDetails ArticlePubMed
TargetMetabotropic glutamate receptor 4(Homo sapiens (Human))
Vanderbilt University
Curated by ChEMBL
LigandPNGBDBM50283481(CHEMBL4160675)
Affinity DataEC50:  2.14E+3nM. Assay description: Positive allosteric modulation of human mGlu4 receptor expressed in CHO cells co-expressing Gqi5 assessed as increase in glutamate-induced calcium mo...
In DepthDetails ArticlePubMed
TargetMetabotropic glutamate receptor 4(Homo sapiens (Human))
Vanderbilt University
Curated by ChEMBL
LigandPNGBDBM50283481(CHEMBL4160675)
Affinity DataEC50:  2.10E+3nM. Assay description: Positive allosteric modulation of human mGlu4 receptor expressed in CHO cells co-expressing Gqi5 assessed as increase in glutamate-induced calcium mo...
In DepthDetails ArticlePubMed
TargetMetabotropic glutamate receptor 7(Rattus norvegicus (Rat))
Vanderbilt University
Curated by ChEMBL
LigandPNGBDBM50283481(CHEMBL4160675)
Affinity DataEC50:  741nM. Assay description: Positive allosteric modulation of rat mGlu7 receptor expressed in HEK cells co-expressing Galphai5 assessed as increase in glutamate-induced calcium ...
In DepthDetails ArticlePubMed
TargetMetabotropic glutamate receptor 8(Rattus norvegicus (Rat))
Vanderbilt University
Curated by ChEMBL
LigandPNGBDBM50283481(CHEMBL4160675)
Affinity DataEC50:  890nM. Assay description: Positive allosteric modulation of rat mGlu8 receptor expressed in HEK cells co-expressing Galphai5 assessed as increase in glutamate-induced calcium ...
In DepthDetails ArticlePubMed