BDBM50283811 CHEMBL95767::[(1S,2S,3S,4S)-1-Benzyl-4-((S)-2-benzyloxycarbonylamino-3-methyl-butyrylamino)-3-hydroxy-2-hydroxymethyl-5-phenyl-pentyl]-carbamic acid tert-butyl ester
SMILES CC(C)[C@H](NC(=O)OCc1ccccc1)C(=O)N[C@@H](Cc1ccccc1)[C@@H](O)[C@H](CO)[C@H](Cc1ccccc1)NC(=O)OC(C)(C)C
InChI Key InChIKey=NFRLOVHUTPWZIU-UZYORVLWSA-N
Data  1 KI
  Tab Delimited (TSV)   2D SDfile   Computed 3D by Vconf -m prep SDfile
Find this compound or compounds like it in BindingDB:
Activity Spreadsheet -- Enzyme Inhibition Constant Data from BindingDB
Found 1 hit for monomerid = 50283811
TargetGag-Pol polyprotein [489-587](Human immunodeficiency virus type 1)
TBA
Curated by ChEMBL
LigandPNGBDBM50283811(CHEMBL95767 | [(1S,2S,3S,4S)-1-Benzyl-4-((S)-2-ben...)
Affinity DataKi:  290nM. Assay description: Binding affinity for HIV-1 protease
In DepthDetails Article