BDBM50284197 (E)-(9S,12S,13R,14S,17R,21S,23S,24R,25S,27S)-12-[(E)-2-((1R,3R,4R)-3-Allyloxy-4-hydroxy-cyclohexyl)-1-methyl-vinyl]-17-ethyl-1,14-dihydroxy-23,25-dimethoxy-13,19,21,27-tetramethyl-11,28-dioxa-4-aza-tricyclo[22.3.1.0*4,9*]octacos-18-ene-2,3,10,16-tetraone::CHEMBL170544
SMILES CC[C@@H]1\C=C(C)\C[C@H](C)C[C@H](OC)[C@H]2OC(O)([C@@H](C)C[C@@H]2OC)C(=O)C(=O)N2CCCC[C@H]2C(=O)O[C@@H]([C@H](C)[C@@H](O)CC1=O)C(\C)=C\[C@@H]1CC[C@@H](O)[C@@H](C1)OCC=C
InChI Key InChIKey=OIXIUKSEXGGDAU-MZXXYLFESA-N
Data  1 EC50
  Tab Delimited (TSV)   2D SDfile   Computed 3D by Vconf -m prep SDfile
Find this compound or compounds like it in BindingDB:
Activity Spreadsheet -- Enzyme Inhibition Constant Data from BindingDB
Found 1 hit for monomerid = 50284197
TargetPeptidyl-prolyl cis-trans isomerase FKBP1A(Homo sapiens (Human))
TBA
Curated by ChEMBL
LigandPNGBDBM50284197((E)-(9S,12S,13R,14S,17R,21S,23S,24R,25S,27S)-12-[(...)
Affinity DataEC50:  2.70nM. Assay description: Ability to bind the major cystolic receptor FK506 binding protein 12 by using competitive binding assay
In DepthDetails Article