BDBM50284685 (3S,4S)-6-(5-Bromo-6-methyl-pyridin-2-ylmethoxy)-3-pyridin-3-ylmethyl-chroman-4-ol::CHEMBL31325
SMILES Cc1nc(COc2ccc3OC[C@H](Cc4cccnc4)[C@H](O)c3c2)ccc1Br
InChI Key InChIKey=XPORXQYLGDNCDH-AOMKIAJQSA-N
Data  1 KI
  Tab Delimited (TSV)   2D SDfile   Computed 3D by Vconf -m prep SDfile
Find this compound or compounds like it in BindingDB:
Activity Spreadsheet -- Enzyme Inhibition Constant Data from BindingDB
Found 1 hit for monomerid = 50284685
TargetCysteinyl leukotriene receptor 1(GUINEA PIG)
TBA
Curated by ChEMBL
LigandPNGBDBM50284685((3S,4S)-6-(5-Bromo-6-methyl-pyridin-2-ylmethoxy)-3...)
Affinity DataKi:  1.56E+3nM. Assay description: Compound was tested for the inhibition of [3H]-leukotriene D4 binding to LTD4 receptor in guinea pig lung membranes
In DepthDetails Article