BDBM50285683 (1-{(R)-1-{3-[(E)-2-(2,3-Dichloro-thieno[3,2-b]pyridin-5-yl)-vinyl]-phenyl}-3-[2-(1-hydroxy-1-methyl-ethyl)-phenyl]-propylsulfanylmethyl}-cyclopropyl)-acetic acid::CHEMBL87337
SMILES CC(C)(O)c1ccccc1CC[C@@H](SCC1(CC(O)=O)CC1)c1cccc(\C=C\c2ccc3sc(Cl)c(Cl)c3n2)c1
InChI Key InChIKey=SOUXTOZGVBFBFE-LEYIMRRPSA-N
Data  1 IC50
  Tab Delimited (TSV)   2D SDfile   Computed 3D by Vconf -m prep SDfile
Find this compound or compounds like it in BindingDB:
Activity Spreadsheet -- Enzyme Inhibition Constant Data from BindingDB
Found 1 hit for monomerid = 50285683
TargetCysteinyl leukotriene receptor 1(Homo sapiens (Human))
TBA
Curated by ChEMBL
LigandPNGBDBM50285683((1-{(R)-1-{3-[(E)-2-(2,3-Dichloro-thieno[3,2-b]pyr...)
Affinity DataIC50:  0.550nM. Assay description: Inhibition of binding of [ H]-LTD4 to DMSO differentiated U937 cell membranes
In DepthDetails Article