BDBM50286868 (1S,2S,4S)-2-{2-[(S)-2-({1-[6-Amino-2-(2,6-diamino-hexylamino)-hexanoyl]-pyrrolidine-2-carbonyl}-amino)-3-(4-hydroxy-phenyl)-1-(S)-oxo-propylamino]-3,3-dimethyl-butyrylamino}-4-methyl-pentanoic acid::CHEMBL6508
SMILES CC(C)C[C@H](NC(=O)[C@@H](NC(=O)[C@H](Cc1ccc(O)cc1)NC(=O)[C@H]1CCCN1C(=O)[C@H](CCCCN)NC[C@@H](N)CCCCN)C(C)(C)C)C(O)=O
InChI Key InChIKey=GPDCLTFREWTNBN-ZCLHSLMCSA-N
Data  1 KI
  Tab Delimited (TSV)   2D SDfile   Computed 3D by Vconf -m prep SDfile
Find this compound or compounds like it in BindingDB:
Activity Spreadsheet -- Enzyme Inhibition Constant Data from BindingDB
Found 1 hit for monomerid = 50286868
TargetNeurotensin receptor type 1(MOUSE)
TBA
Curated by ChEMBL
LigandPNGBDBM50286868((1S,2S,4S)-2-{2-[(S)-2-({1-[6-Amino-2-(2,6-diamino...)
Affinity DataKi:  0.400nM. Assay description: Binding affinity for Neurotensin Receptor
In DepthDetails Article