BDBM50287117 (S)-3-Phenyl-2-((4E,8E)-5,9,13-trimethyl-2-phosphono-tetradeca-4,8,12-trienoylamino)-propionic acid methyl ester::CHEMBL26235
SMILES [#6]-[#8]-[#6](=O)-[#6@H](-[#6]-c1ccccc1)-[#7]-[#6](=O)-[#6](=[#6]-[#6]-[#6](-[#6])-[#6]-[#6]\[#6]=[#6](/[#6])-[#6]-[#6]\[#6]=[#6](\[#6])-[#6])P([#8])([#8])=O
InChI Key InChIKey=MXRXVIWCQICXLB-WUZNFZNHSA-N
Data  2 IC50
  Tab Delimited (TSV)   2D SDfile   Computed 3D by Vconf -m prep SDfile
Find this compound or compounds like it in BindingDB:
Activity Spreadsheet -- Enzyme Inhibition Constant Data from BindingDB
Found 2 hits for monomerid = 50287117
LigandPNGBDBM50287117((S)-3-Phenyl-2-((4E,8E)-5,9,13-trimethyl-2-phospho...)
Affinity DataIC50: >1.00E+5nM. Assay description: Inhibition of Farnesyltransferase from bovine brain
In DepthDetails Article
TargetSqualene synthase(Rattus norvegicus)
TBA
Curated by ChEMBL
LigandPNGBDBM50287117((S)-3-Phenyl-2-((4E,8E)-5,9,13-trimethyl-2-phospho...)
Affinity DataIC50:  1.40E+3nM. Assay description: Inhibition of squalene synthase from rat liver microsomes
In DepthDetails Article