BDBM50287404 2-Amino-N-[(2R,4S)-2-benzyl-1-(3,5-bis-trifluoromethyl-benzoyl)-piperidin-4-yl]-acetamide::CHEMBL42800
SMILES NCC(=O)N[C@H]1CCN([C@H](Cc2ccccc2)C1)C(=O)c1cc(cc(c1)C(F)(F)F)C(F)(F)F
InChI Key InChIKey=AHAWVKZRZJNCMC-RBUKOAKNSA-N
Data  1 IC50
  Tab Delimited (TSV)   2D SDfile   Computed 3D by Vconf -m prep SDfile
Find this compound or compounds like it in BindingDB:
Activity Spreadsheet -- Enzyme Inhibition Constant Data from BindingDB
Found 1 hit for monomerid = 50287404
TargetSubstance-P receptor(Homo sapiens (Human))
TBA
Curated by ChEMBL
LigandPNGBDBM50287404(2-Amino-N-[(2R,4S)-2-benzyl-1-(3,5-bis-trifluorome...)
Affinity DataIC50:  62nM. Assay description: Inhibition of [3H]-SP radioligand binding to NK1 receptor from bovine retina
In DepthDetails Article