BDBM50287526 6-(4-Amino-benzenesulfonyl)-5-nitro-quinolin-8-ylamine::CHEMBL53016::PD-9262
SMILES Nc1ccc(cc1)S(=O)(=O)c1cc(N)c2ncccc2c1[N+]([O-])=O
InChI Key InChIKey=PXYHVIRZNYCJCU-UHFFFAOYSA-N
Data  2 KI
  Tab Delimited (TSV)   2D SDfile   Computed 3D by Vconf -m prep SDfile
Find this compound or compounds like it in BindingDB:
Activity Spreadsheet -- Enzyme Inhibition Constant Data from BindingDB
Found 2 hits for monomerid = 50287526
TargetNeuropeptide Y receptor type 1(Homo sapiens (Human))
TBA
Curated by ChEMBL
LigandPNGBDBM50287526(6-(4-Amino-benzenesulfonyl)-5-nitro-quinolin-8-yla...)
Affinity DataKi:  282nM. Assay description: Compound was tested for binding affinity against neuropeptide Y1 (NPY1) receptor from SK-N-MC membranes using [125I]-PYY as radioligand
In DepthDetails Article
TargetNeuropeptide Y receptor type 2(RAT)
TBA
Curated by ChEMBL
LigandPNGBDBM50287526(6-(4-Amino-benzenesulfonyl)-5-nitro-quinolin-8-yla...)
Affinity DataKi: >1.00E+4nM. Assay description: Compound was tested for binding affinity against neuropeptide Y2 (NPY2) receptor from rat hippocampi.
In DepthDetails Article