BDBM50287548 5-Phenyl-3-propyl-1,6-dihydro-pyrazolo[4,3-d]pyrimidin-7-one::5-phenyl-3-propyl-1H-pyrazolo[4,3-d]pyrimidin-7(6H)-one::CHEMBL431544
SMILES CCCc1[nH]nc2c1nc([nH]c2=O)-c1ccccc1
InChI Key InChIKey=VAHVRRBMGUFRSD-UHFFFAOYSA-N
Data  3 IC50
  Tab Delimited (TSV)   2D SDfile   Computed 3D by Vconf -m prep SDfile
Find this compound or compounds like it in BindingDB:
Activity Spreadsheet -- Enzyme Inhibition Constant Data from BindingDB
Found 3 hits for monomerid = 50287548
TargetcGMP-specific 3',5'-cyclic phosphodiesterase(Homo sapiens (Human))
TBA
Curated by ChEMBL
LigandPNGBDBM50287548(5-Phenyl-3-propyl-1,6-dihydro-pyrazolo[4,3-d]pyrim...)
Affinity DataIC50:  4.50E+3nM. Assay description: Inhibition of Phosphodiesterase 5 from rabbit platelets
In DepthDetails Article
TargetcGMP-inhibited 3',5'-cyclic phosphodiesterase 3A/3B(Homo sapiens (Human))
TBA
Curated by ChEMBL
LigandPNGBDBM50287548(5-Phenyl-3-propyl-1,6-dihydro-pyrazolo[4,3-d]pyrim...)
Affinity DataIC50:  6.30E+4nM. Assay description: Inhibition of Phosphodiesterase 3 from rabbit platelets
In DepthDetails Article
TargetcGMP-specific 3',5'-cyclic phosphodiesterase(Homo sapiens (Human))
TBA
Curated by ChEMBL
LigandPNGBDBM50287548(5-Phenyl-3-propyl-1,6-dihydro-pyrazolo[4,3-d]pyrim...)
Affinity DataIC50:  81nM. Assay description: Inhibition of PDE5
In DepthDetails ArticlePubMed