BDBM50287865 (S)-3-Biphenyl-4-yl-2-((S)-2-mercaptomethyl-3-phenyl-propionylamino)-propionic acid::CHEMBL77706
SMILES OC(=O)[C@H](Cc1ccc(cc1)-c1ccccc1)NC(=O)[C@@H](CS)Cc1ccccc1
InChI Key InChIKey=KSBCINBAPFBEDZ-PKTZIBPZSA-N
Data  1 IC50
  Tab Delimited (TSV)   2D SDfile   Computed 3D by Vconf -m prep SDfile
Find this compound or compounds like it in BindingDB:
Activity Spreadsheet -- Enzyme Inhibition Constant Data from BindingDB
Found 1 hit for monomerid = 50287865
TargetEndothelin-converting enzyme 1(Rattus norvegicus (Rat))
TBA
Curated by ChEMBL
LigandPNGBDBM50287865((S)-3-Biphenyl-4-yl-2-((S)-2-mercaptomethyl-3-phen...)
Affinity DataIC50:  150nM. Assay description: In vitro inhibition of Endothelin-converting enzyme 1 from rat lungs.
In DepthDetails Article