BDBM50287875 (S)-2-(3-Biphenyl-4-yl-2-mercaptomethyl-propionylamino)-3-(1H-indol-3-yl)-propionic acid::CHEMBL306978
SMILES OC(=O)[C@H](Cc1c[nH]c2ccccc12)NC(=O)C(CS)Cc1ccc(cc1)-c1ccccc1
InChI Key InChIKey=WDDFKXGAVAJHQF-TUXUZCGSSA-N
Data  1 IC50
  Tab Delimited (TSV)   2D SDfile   Computed 3D by Vconf -m prep SDfile
Find this compound or compounds like it in BindingDB:
Activity Spreadsheet -- Enzyme Inhibition Constant Data from BindingDB
Found 1 hit for monomerid = 50287875
TargetEndothelin-converting enzyme 1(Rattus norvegicus (Rat))
TBA
Curated by ChEMBL
LigandPNGBDBM50287875((S)-2-(3-Biphenyl-4-yl-2-mercaptomethyl-propionyla...)
Affinity DataIC50:  40nM. Assay description: In vitro inhibition of Endothelin-converting enzyme 1 from rat lungs.
In DepthDetails Article