BDBM50288649 (1,3-Diphenyl-propyl)-phosphonic acid::CHEMBL106215
SMILES OP(O)(=O)C(CCc1ccccc1)c1ccccc1
InChI Key InChIKey=GKEBQWSROZOYSD-UHFFFAOYSA-N
Data  1 IC50
  Tab Delimited (TSV)   2D SDfile   Computed 3D by Vconf -m prep SDfile
Find this compound or compounds like it in BindingDB:
Activity Spreadsheet -- Enzyme Inhibition Constant Data from BindingDB
Found 1 hit for monomerid = 50288649
TargetProstatic acid phosphatase(Homo sapiens (Human))
TBA
Curated by ChEMBL
LigandPNGBDBM50288649((1,3-Diphenyl-propyl)-phosphonic acid | CHEMBL1062...)
Affinity DataIC50:  1.40E+4nM. Assay description: Inhibition of human prostatic acid phosphatase was determined as inhibition of the hydrolysis of tyrosine phosphate
In DepthDetails Article