BDBM50288661 CHEMBL107858::[2-Biphenyl-4-yl-1-(3-trifluoromethyl-phenyl)-ethyl]-phosphonic acid
SMILES OP(O)(=O)C(Cc1ccc(cc1)-c1ccccc1)c1cccc(c1)C(F)(F)F
InChI Key InChIKey=NRZNRERLJUJPDI-UHFFFAOYSA-N
Data  1 IC50
  Tab Delimited (TSV)   2D SDfile   Computed 3D by Vconf -m prep SDfile
Find this compound or compounds like it in BindingDB:
Activity Spreadsheet -- Enzyme Inhibition Constant Data from BindingDB
Found 1 hit for monomerid = 50288661
TargetProstatic acid phosphatase(Homo sapiens (Human))
TBA
Curated by ChEMBL
LigandPNGBDBM50288661(CHEMBL107858 | [2-Biphenyl-4-yl-1-(3-trifluorometh...)
Affinity DataIC50:  3.60E+4nM. Assay description: Inhibition of human prostatic acid phosphatase was determined as inhibition of the hydrolysis of tyrosine phosphate
In DepthDetails Article