BDBM50288664 (1,2-Diphenyl-ethyl)-phosphonic acid::CHEMBL53486
SMILES OP(O)(=O)C(Cc1ccccc1)c1ccccc1
InChI Key InChIKey=JVQDGCHIZJMTFB-UHFFFAOYSA-N
Data  1 IC50
  Tab Delimited (TSV)   2D SDfile   Computed 3D by Vconf -m prep SDfile
Find this compound or compounds like it in BindingDB:
Activity Spreadsheet -- Enzyme Inhibition Constant Data from BindingDB
Found 1 hit for monomerid = 50288664
TargetProstatic acid phosphatase(Homo sapiens (Human))
TBA
Curated by ChEMBL
LigandPNGBDBM50288664((1,2-Diphenyl-ethyl)-phosphonic acid | CHEMBL53486)
Affinity DataIC50:  8.90E+4nM. Assay description: Inhibition of human prostatic acid phosphatase was determined as inhibition of the hydrolysis of tyrosine phosphate
In DepthDetails Article