BDBM50288878 3-(4-Chloro-phenyl)-2-(4-sulfamoyl-benzoylamino)-propionic acid::CHEMBL152479
SMILES NS(=O)(=O)c1ccc(cc1)C(=O)NC(Cc1ccc(Cl)cc1)C(O)=O
InChI Key InChIKey=QBCQPXMHHFJBQB-UHFFFAOYSA-N
Data  2 Kd  1 Koff  1 Kon
  Tab Delimited (TSV)   2D SDfile   Computed 3D by Vconf -m prep SDfile
Find this compound or compounds like it in BindingDB:
Activity Spreadsheet -- Enzyme Inhibition Constant Data from BindingDB
Found 4 hits for monomerid = 50288878
TargetCarbonic anhydrase 2(Homo sapiens (Human))
TBA
Curated by ChEMBL
LigandPNGBDBM50288878(3-(4-Chloro-phenyl)-2-(4-sulfamoyl-benzoylamino)-p...)
Affinity DataKd:  14nM. Assay description: Dissociation constant against human carbonic anhydrase II at 37 degree centigrade
In DepthDetails Article
TargetCarbonic anhydrase 2(Homo sapiens (Human))
TBA
Curated by ChEMBL
LigandPNGBDBM50288878(3-(4-Chloro-phenyl)-2-(4-sulfamoyl-benzoylamino)-p...)
Affinity DataKoff:  0.0160s-1Assay Description:Kinetic constant for binding human carbonic anhydrase II (Kon=Kd x Koff)
In DepthDetails Article
TargetCarbonic anhydrase 2(Homo sapiens (Human))
TBA
Curated by ChEMBL
LigandPNGBDBM50288878(3-(4-Chloro-phenyl)-2-(4-sulfamoyl-benzoylamino)-p...)
Affinity DataKon:  0.0220M-1s-1Assay Description:Kinetic constant for binding human carbonic anhydrase II
In DepthDetails Article
TargetCarbonic anhydrase 2(Homo sapiens (Human))
TBA
Curated by ChEMBL
LigandPNGBDBM50288878(3-(4-Chloro-phenyl)-2-(4-sulfamoyl-benzoylamino)-p...)
Affinity DataKd:  15nM. Assay description: Dissociation constant against human carbonic anhydrase II at 37 degree centigrade
In DepthDetails Article