BDBM50289384 8-Methoxy-1,2,3,4-tetrahydro-naphthalene-1-carboxylic acid {3-[4-(2-methoxy-phenyl)-piperazin-1-yl]-propyl}-amide::CHEMBL283211
SMILES COc1ccccc1N1CCN(CCCNC(=O)C2CCCc3cccc(OC)c23)CC1
InChI Key InChIKey=FQRDAWJJGHRRCG-UHFFFAOYSA-N
Data  3 KI
  Tab Delimited (TSV)   2D SDfile   Computed 3D by Vconf -m prep SDfile
Find this compound or compounds like it in BindingDB:
Activity Spreadsheet -- Enzyme Inhibition Constant Data from BindingDB
Found 3 hits for monomerid = 50289384
TargetD(2) dopamine receptor(Rattus norvegicus (rat))
TBA
Curated by ChEMBL
LigandPNGBDBM50289384(8-Methoxy-1,2,3,4-tetrahydro-naphthalene-1-carboxy...)
Affinity DataKi:  40nM. Assay description: Displacement of [3H]-spiperone from Dopamine receptor D2 of rat corpora striata synaptic membranes
In DepthDetails Article
TargetD(4) dopamine receptor(Homo sapiens (Human))
TBA
Curated by ChEMBL
LigandPNGBDBM50289384(8-Methoxy-1,2,3,4-tetrahydro-naphthalene-1-carboxy...)
Affinity DataKi:  49nM. Assay description: Displacement of [3H]-YM-09151-2 from human Dopamine receptor D4.2 expressed in baculovirus Sf9 cells
In DepthDetails Article
TargetAlpha-1A/Alpha-1B/Alpha-1D adrenergic receptor(Rattus norvegicus (rat))
TBA
Curated by ChEMBL
LigandPNGBDBM50289384(8-Methoxy-1,2,3,4-tetrahydro-naphthalene-1-carboxy...)
Affinity DataKi:  70nM. Assay description: Displacement of [3H]prazosin from Alpha-1 adrenergic receptor of rat cerebral cortex
In DepthDetails Article