BDBM50289438 (4R,5S,6S,7R)-4,7-Dibenzyl-5,6-dihydroxy-1-(3-hydroxymethyl-benzyl)-3-(5-hydroxy-pentyl)-[1,3]diazepan-2-one::CHEMBL29011
SMILES OCCCCCN1[C@H](Cc2ccccc2)[C@H](O)[C@@H](O)[C@@H](Cc2ccccc2)N(Cc2cccc(CO)c2)C1=O
InChI Key InChIKey=QMZHGXPLZJHFBF-VKONIRKNSA-N
Data  1 KI
  Tab Delimited (TSV)   2D SDfile   Computed 3D by Vconf -m prep SDfile
Find this compound or compounds like it in BindingDB:
Activity Spreadsheet -- Enzyme Inhibition Constant Data from BindingDB
Found 1 hit for monomerid = 50289438
TargetGag-Pol polyprotein [489-587](Human immunodeficiency virus type 1)
TBA
Curated by ChEMBL
LigandPNGBDBM50289438((4R,5S,6S,7R)-4,7-Dibenzyl-5,6-dihydroxy-1-(3-hydr...)
Affinity DataKi:  0.0580nM. Assay description: Inhibitory activity against HIV-1 protease
In DepthDetails Article