BDBM50289472 CHEMBL33036::N-(1-Octadecyloxymethyl-pent-4-enyl)-acetamide
SMILES CCCCCCCCCCCCCCCCCCOCC(CCC=C)NC(C)=O
InChI Key InChIKey=PMYNSBPXTCEFES-UHFFFAOYSA-N
Data  1 IC50
  Tab Delimited (TSV)   2D SDfile   Computed 3D by Vconf -m prep SDfile
Find this compound or compounds like it in BindingDB:
Activity Spreadsheet -- Enzyme Inhibition Constant Data from BindingDB
Found 1 hit for monomerid = 50289472
TargetPutative inactive group IIC secretory phospholipase A2(Homo sapiens (Human))
TBA
Curated by ChEMBL
LigandPNGBDBM50289472(CHEMBL33036 | N-(1-Octadecyloxymethyl-pent-4-enyl)...)
Affinity DataIC50:  8.00E+3nM. Assay description: Inhibition of human Secretory phospholipase A 2 acyl hydrolysis using a membrane assay
In DepthDetails Article