BDBM50290032 2-[1-(4-Chloro-benzyl)-1,2,3,6-tetrahydro-pyridin-4-yl]-benzothiazole::CHEMBL306265
SMILES Clc1ccc(CN2CCC(=CC2)c2nc3ccccc3s2)cc1
InChI Key InChIKey=ASYJQHKPLFUJFY-UHFFFAOYSA-N
Data  3 KI
  Tab Delimited (TSV)   2D SDfile   Computed 3D by Vconf -m prep SDfile
Find this compound or compounds like it in BindingDB:
Activity Spreadsheet -- Enzyme Inhibition Constant Data from BindingDB
Found 3 hits for monomerid = 50290032
TargetD(4) dopamine receptor(Homo sapiens (Human))
TBA
Curated by ChEMBL
LigandPNGBDBM50290032(2-[1-(4-Chloro-benzyl)-1,2,3,6-tetrahydro-pyridin-...)
Affinity DataKi:  1.30nM. Assay description: Displacement of [3H]-spiperone from human dopamine receptor subtype hD4 expressed in HEK293 cells
In DepthDetails Article
TargetD(2) dopamine receptor(Homo sapiens (Human))
TBA
Curated by ChEMBL
LigandPNGBDBM50290032(2-[1-(4-Chloro-benzyl)-1,2,3,6-tetrahydro-pyridin-...)
Affinity DataKi: >1.60E+3nM. Assay description: Displacement of [3H]-spiperone from human dopamine D2 receptor in CHO cells
In DepthDetails Article
TargetD(3) dopamine receptor(Homo sapiens (Human))
TBA
Curated by ChEMBL
LigandPNGBDBM50290032(2-[1-(4-Chloro-benzyl)-1,2,3,6-tetrahydro-pyridin-...)
Affinity DataKi: >4.40E+3nM. Assay description: Displacement of [3H]-spiperone from human dopamine receptor subtype hD3 expressed in CHO cells
In DepthDetails Article