BDBM50290071 CHEMBL542149::N-[(S)-1-(3-Amino-phenyl)-2-pyrrolidin-1-yl-ethyl]-2-(3,4-dichloro-phenyl)-N-methyl-acetamide; hydrochloride
SMILES CN([C@H](CN1CCCC1)c1cccc(N)c1)C(=O)Cc1ccc(Cl)c(Cl)c1
InChI Key InChIKey=GZGGYQMNFMHDFI-HXUWFJFHSA-N
Data  3 KI
  Tab Delimited (TSV)   2D SDfile   Computed 3D by Vconf -m prep SDfile
Find this compound or compounds like it in BindingDB:
Activity Spreadsheet -- Enzyme Inhibition Constant Data from BindingDB
Found 3 hits for monomerid = 50290071
TargetKappa-type opioid receptor(Cavia porcellus (domestic guinea pig))
TBA
Curated by ChEMBL
LigandPNGBDBM50290071(CHEMBL542149 | N-[(S)-1-(3-Amino-phenyl)-2-pyrroli...)
Affinity DataKi:  0.0592nM. Assay description: Compound was evaluated for the inhibition of Opioid receptor kappa1 binding to guinea pig brain membranes, using 1 nM [3H]- U69,593 as radioligand
In DepthDetails Article
TargetMu-type opioid receptor(GUINEA PIG)
TBA
Curated by ChEMBL
LigandPNGBDBM50290071(CHEMBL542149 | N-[(S)-1-(3-Amino-phenyl)-2-pyrroli...)
Affinity DataKi:  7.70nM. Assay description: Compound was evaluated for the inhibition of Opioid receptor mu 1 binding to guinea pig brain membranes, using [3H]- DAMGO as radioligand
In DepthDetails Article
TargetDelta-type opioid receptor(Homo sapiens (Human))
TBA
Curated by ChEMBL
LigandPNGBDBM50290071(CHEMBL542149 | N-[(S)-1-(3-Amino-phenyl)-2-pyrroli...)
Affinity DataKi:  7.80nM. Assay description: Compound was evaluated for the inhibition of Opioid receptor delta 1 binding to guinea pig brain membranes, using 0.2 nM [3H]-naltrindole as radiolig...
In DepthDetails Article