BDBM50290210 CHEMBL78368::Thiophene-2-carboxylic acid (4-{2-[4-(3-chloro-phenyl)-piperazin-1-yl]-ethyl}-cyclohexyl)-amide
SMILES Clc1cccc(c1)N1CCN(CC[C@H]2CC[C@@H](CC2)NC(=O)c2cccs2)CC1
InChI Key InChIKey=MBJIMEPOUWVXCI-KESTWPANSA-N
Data  2 KI
  Tab Delimited (TSV)   2D SDfile   Computed 3D by Vconf -m prep SDfile
Find this compound or compounds like it in BindingDB:
Activity Spreadsheet -- Enzyme Inhibition Constant Data from BindingDB
Found 2 hits for monomerid = 50290210
TargetD(3) dopamine receptor(Homo sapiens (Human))
TBA
Curated by ChEMBL
LigandPNGBDBM50290210(CHEMBL78368 | Thiophene-2-carboxylic acid (4-{2-[4...)
Affinity DataKi:  2nM. Assay description: Ability to displace radioligand [3H]spiperone from human dopamine D3 receptor transfected chinese hamster ovary cell membranes.
In DepthDetails Article
TargetD(2) dopamine receptor(Homo sapiens (Human))
TBA
Curated by ChEMBL
LigandPNGBDBM50290210(CHEMBL78368 | Thiophene-2-carboxylic acid (4-{2-[4...)
Affinity DataKi:  6.5nM. Assay description: Ability to displace radioligand [3H]N-0437 from human dopamine D2 receptor transfected chinese hamster ovary cell membranes.
In DepthDetails Article