BDBM50290295 1'-{2-[3-(3,4-Dichloro-phenyl)-1-(3,4,5-trimethoxy-benzoyl)-pyrrolidin-3-yl]-ethyl}-2',3',5',6'-tetrahydro-1'H-[3,4']bipyridinyl-4'-carboxylic acid amide::CHEMBL314119
SMILES COc1cc(cc(OC)c1OC)C(=O)N1CCC(CCN2CCC(CC2)(C(N)=O)c2cccnc2)(C1)c1ccc(Cl)c(Cl)c1
InChI Key InChIKey=HYKVHMXJPZXOSZ-UHFFFAOYSA-N
Data  2 IC50
  Tab Delimited (TSV)   2D SDfile   Computed 3D by Vconf -m prep SDfile
Find this compound or compounds like it in BindingDB:
Activity Spreadsheet -- Enzyme Inhibition Constant Data from BindingDB
Found 2 hits for monomerid = 50290295
TargetSubstance-K receptor(Mus musculus)
TBA
Curated by ChEMBL
LigandPNGBDBM50290295(1'-{2-[3-(3,4-Dichloro-phenyl)-1-(3,4,5-trimethoxy...)
Affinity DataIC50:  16nM. Assay description: Binding affinity for NK2 receptor in HSKR-1 cells was determined by using [125 I ]-Iodohistidyl NKA.
In DepthDetails Article
TargetSubstance-P receptor(GUINEA PIG)
TBA
Curated by ChEMBL
LigandPNGBDBM50290295(1'-{2-[3-(3,4-Dichloro-phenyl)-1-(3,4,5-trimethoxy...)
Affinity DataIC50:  8.10nM. Assay description: Binding affinity for NK1 receptor in guinea pig lung was determined by using [125 I]-Bolton Hunter labeled SP
In DepthDetails Article