BDBM50290309 1-{2-[3-(3-Chloro-phenyl)-1-(3,4,5-trimethoxy-benzoyl)-pyrrolidin-3-yl]-ethyl}-4-phenyl-piperidine-4-carboxylic acid amide::CHEMBL83585
SMILES COc1cc(cc(OC)c1OC)C(=O)N1CCC(CCN2CCC(CC2)(C(N)=O)c2ccccc2)(C1)c1cccc(Cl)c1
InChI Key InChIKey=VJGOUBCAZPOTIY-UHFFFAOYSA-N
Data  2 IC50
  Tab Delimited (TSV)   2D SDfile   Computed 3D by Vconf -m prep SDfile
Find this compound or compounds like it in BindingDB:
Activity Spreadsheet -- Enzyme Inhibition Constant Data from BindingDB
Found 2 hits for monomerid = 50290309
TargetSubstance-K receptor(Mus musculus)
TBA
Curated by ChEMBL
LigandPNGBDBM50290309(1-{2-[3-(3-Chloro-phenyl)-1-(3,4,5-trimethoxy-benz...)
Affinity DataIC50:  190nM. Assay description: Binding affinity for NK2 receptor in HSKR-1 cells was determined by using [125 I ]-Iodohistidyl NKA.
In DepthDetails Article
TargetSubstance-P receptor(GUINEA PIG)
TBA
Curated by ChEMBL
LigandPNGBDBM50290309(1-{2-[3-(3-Chloro-phenyl)-1-(3,4,5-trimethoxy-benz...)
Affinity DataIC50:  11nM. Assay description: Binding affinity for NK1 receptor in guinea pig lung was determined by using [125 I]-Bolton Hunter labeled SP
In DepthDetails Article