BDBM50290331 Acetic acid 2-acetoxy-6-(3-acetoxy-2,5-diformyl-benzoyl)-phenyl ester::CHEMBL87715
SMILES CC(=O)Oc1cccc(C(=O)c2cc(C=O)cc(OC(C)=O)c2C=O)c1OC(C)=O
InChI Key InChIKey=MAAWYCFLRIXFOO-UHFFFAOYSA-N
Data  1 IC50
  Tab Delimited (TSV)   2D SDfile   Computed 3D by Vconf -m prep SDfile
Find this compound or compounds like it in BindingDB:
Activity Spreadsheet -- Enzyme Inhibition Constant Data from BindingDB
Found 1 hit for monomerid = 50290331
LigandPNGBDBM50290331(Acetic acid 2-acetoxy-6-(3-acetoxy-2,5-diformyl-be...)
Affinity DataIC50:  2.40E+3nM. Assay description: Inhibition of Farnesyltransferase
In DepthDetails Article