BDBM50291223 CHEMBL150134::Naphthalene-2-carboxylic acid {(S)-1-[(R)-1-((R)-1-formyl-3-methyl-butylcarbamoyl)-3-methyl-butylcarbamoyl]-3-methyl-butyl}-amide
SMILES CC(C)C[C@@H](NC(=O)[C@@H](CC(C)C)NC(=O)[C@H](CC(C)C)NC(=O)c1ccc2ccccc2c1)C=O
InChI Key InChIKey=CURXVCYJFAPKNM-CYXNTTPDSA-N
Data  1 IC50
  Tab Delimited (TSV)   2D SDfile   Computed 3D by Vconf -m prep SDfile
Find this compound or compounds like it in BindingDB:
Activity Spreadsheet -- Enzyme Inhibition Constant Data from BindingDB
Found 1 hit for monomerid = 50291223
TargetCalpain-1 catalytic subunit(Homo sapiens (Human))
TBA
Curated by ChEMBL
LigandPNGBDBM50291223(CHEMBL150134 | Naphthalene-2-carboxylic acid {(S)-...)
Affinity DataIC50:  10nM. Assay description: Inhibitory activity evaluated against recombinant human calpain 1
In DepthDetails Article