BDBM50291225 CHEMBL357595::{(S)-1-[(R)-1-((R)-1-Formyl-3-methyl-butylcarbamoyl)-3-methyl-butylcarbamoyl]-ethyl}-carbamic acid benzyl ester
SMILES CC(C)C[C@@H](NC(=O)[C@@H](CC(C)C)NC(=O)[C@H](C)NC(=O)OCc1ccccc1)C=O
InChI Key InChIKey=ZHZIDTPZZAWMBN-DFQSSKMNSA-N
Data  1 IC50
  Tab Delimited (TSV)   2D SDfile   Computed 3D by Vconf -m prep SDfile
Find this compound or compounds like it in BindingDB:
Activity Spreadsheet -- Enzyme Inhibition Constant Data from BindingDB
Found 1 hit for monomerid = 50291225
TargetCalpain-1 catalytic subunit(Homo sapiens (Human))
TBA
Curated by ChEMBL
LigandPNGBDBM50291225(CHEMBL357595 | {(S)-1-[(R)-1-((R)-1-Formyl-3-methy...)
Affinity DataIC50:  5nM. Assay description: Inhibitory activity evaluated against recombinant human calpain 1
In DepthDetails Article